facebook/fbthrift: Facebook's branch of Apache Thrift, including a new C++ server.

2368
STARS
187
WATCHERS
584
FORKS
45
ISSUES

fbthrift Recent Issues

Issue Title State Comments Created Date Updated Date
ThriftLibrary.cmake is invalid closed 3 2022-09-13 2022-09-30
libssl-dev needed for Debian build closed 4 2022-09-13 2022-09-30
thrift go client usage open 0 2022-09-07 2022-09-30
error: use of undeclared identifier 'errno' closed 1 2022-08-27 2022-09-30
feature-request: compile-time name to id function closed 7 2022-08-24 2022-09-30
Build failure: no member named 'token' in 'apache::thrift::compiler::yy::parser::symbol_type' closed 2 2022-08-17 2022-09-30
error: implicit instantiation of undefined template 'std::basic_ifstream<char>' closed 1 2022-08-15 2022-09-30
thrift1: undefined symbol: _ZN6apache6thrift8compiler14parsing_driverC1ERNS1_14source_managerERNS1_18diagnostic_contextENSt7__cxx1112basic_stringIcSt11char_traitsIcESaIcEEENS1_14parsing_paramsE closed 2 2022-07-25 2022-09-30
Ubuntu 20.04 cannot compile with __clang_major__>=9 closed 8 2022-07-11 2022-09-30
compilation error in "clang & libstdc++-12.1 & c++20" open 0 2022-07-03 2022-09-30
options of mstch_cpp2 (cpp2) open 0 2022-07-02 2022-09-30
python asyncio oneway method open 0 2022-06-22 2022-09-30
error: aggregate ‘std::ofstream genfile’ has incomplete type and cannot be defined closed 1 2022-05-30 2022-09-30
Several build errors, problem with generated CPP code open 0 2022-04-22 2022-09-30
2022.04.04.00: error: no member named 'token' in 'apache::thrift::compiler::yy::parser::symbol_type' closed 1 2022-04-08 2022-09-30
OSS build failing: parse/thrifty.yy:65:13: error: ‘struct apache::thrift::compiler::yy::parser::symbol_type’ has no member named ‘token’ closed 11 2022-03-31 2022-09-30
The bug in folly/fbthrift interaction with libevent 2.*. open 4 2022-03-28 2022-09-30
Cannot build the chatroom example (the headers are not installed in one place) open 0 2022-03-04 2022-09-30
libthriftcpp2.so: error: undefined reference to 'apache::thrift::RequestPileBase::onDequeued(apache::thrift::ServerRequest&)' closed 1 2022-02-25 2022-09-30
Can't compile fbthrift with clang: thrift/lib/cpp/ContextStack.cpp:229:5: error: no matching function for call to 'operator delete' open 0 2022-02-24 2022-09-30
Difference between Rocket Parser::readDataAvailable methods. open 1 2022-02-09 2022-09-30
How TThreadedSelectorServer support saml ? closed 1 2022-02-02 2022-09-30
Linker error: libthriftcpp2.so: error: undefined reference to 'apache::thrift::TrustedServerException::unimplementedMethodError(char const*)' closed 2 2022-01-27 2022-09-30
/usr/include/stdc-predef.h:32:92: internal compiler error: Segmentation fault closed 2 2022-01-26 2022-09-30
Is there any way to disable plaintext over SSL transport? open 0 2021-12-09 2022-09-30
is there any reason only java fbthrift doesn't have ssl socket? closed 1 2021-09-28 2022-09-30
Http2 transport code not included in cmakelist open 2 2021-09-14 2022-09-30
Linker error: Undefined symbols for architecture, problem with folly open 4 2021-08-20 2022-09-30
gcc, c++20 compilation error: constructor syntax closed 1 2021-08-20 2022-09-30
Pros and Cons of Supporting Remote Direct Memory Access (RDMA) Transport in fbthrift open 0 2021-08-04 2022-09-30
How to use async streaming closed 1 2021-08-04 2022-09-30
Question: Is the generated rust code production ready? closed 1 2021-07-30 2022-09-30
Could I specify the implementation of container in rust generating? closed 1 2021-07-23 2022-09-30
Could we specify the ref_type in rust generating like cpp as `cpp.ref_type`? closed 1 2021-07-23 2022-09-30
Add `gen-cpp2` (and other codegen) to the build artifacts open 0 2021-07-01 2022-09-30
Mac CI artifacts should link to provided libraries using `@rpath` or relative paths, not fixed paths in `/usr/local/` open 0 2021-07-01 2022-09-30
Build/Link error on windows (dynamic) open 0 2021-06-19 2022-09-30
Versions are the same closed 1 2021-06-14 2022-09-30
cmake configure error: _add_library cannot create imported target "sodium" because another target with the same name already exists. closed 2 2021-06-01 2022-09-30
fatal error: folly/experimental/channels/detail/AtomicQueue.h: No such file or directory open 3 2021-05-29 2022-09-30
too many arguments to function void folly::detail_tag_invoke_fn::tag_invoke() closed 1 2021-05-12 2022-09-30
Build instructions for mstch_py3 generated code open 4 2021-05-01 2022-09-30
Compile failed with the wrong usage of gmock. open 0 2021-04-25 2022-09-30
How to bind multi services to one port with ThriftServer in cpp2? closed 1 2021-04-23 2022-09-30
reflection: set_members with nested_struct closed 1 2021-04-19 2022-09-30
go lib throw "Invalid data length" closed 2 2021-04-06 2022-09-30
perf client build with coroutines, error building closed 1 2021-04-05 2022-09-30
best practice to return a future in a service callback closed 4 2021-03-25 2022-09-30
Pluggable issue open 0 2021-03-22 2022-01-16
2021.03.15.00: Build fails: Unknown CMake command "thrift_generate". open 0 2021-03-15 2022-09-30

facebook's Other Repos