Adding blurRadius to ImageBackground leads to crash

This issue has been created since 2022-11-16.

Description

When i add blurRadius to , then it crashes the app.
Note: it is only happening on some images.

Version

0.69.7

Output of npx react-native info

System:
OS: macOS 11.4
CPU: (8) x64 Apple M1
Memory: 30.04 MB / 16.00 GB
Shell: 5.8 - /bin/zsh
Binaries:
Node: 14.18.0 - /usr/local/bin/node
Yarn: Not Found
npm: 6.14.15 - /usr/local/bin/npm
Watchman: 2021.09.27.00 - /opt/homebrew/bin/watchman
Managers:
CocoaPods: 1.11.3 - /usr/local/bin/pod
SDKs:
iOS SDK:
Platforms: iOS 15.0, DriverKit 20.4, macOS 11.3, tvOS 15.0, watchOS 8.0
Android SDK:
API Levels: 21, 31
Build Tools: 21.1.2, 28.0.3, 29.0.2, 30.0.0, 30.0.2, 31.0.0
System Images: android-22 | Google APIs ARM 64 v8a, android-22 | Google APIs Intel x86 Atom, android-23 | Google APIs ARM EABI v7a, android-23 | Google APIs Intel x86 Atom, android-23 | Google APIs Intel x86 Atom_64, android-24 | Google APIs ARM 64 v8a, android-24 | Google APIs Intel x86 Atom, android-25 | ARM 64 v8a, android-25 | Google Play Intel x86 Atom, android-26 | Google Play Intel x86 Atom, android-27 | Google APIs ARM 64 v8a, android-28 | Google APIs ARM 64 v8a, android-28 | Google APIs Intel x86 Atom_64, android-32 | Google Play ARM 64 v8a
Android NDK: Not Found
IDEs:
Android Studio: 2021.2 AI-212.5712.43.2112.8609683
Xcode: 13.0/13A233 - /usr/bin/xcodebuild
Languages:
Java: 1.8.0_292 - /usr/bin/javac
npmPackages:
@react-native-community/cli: Not Found
react: Not Found
react-native: Not Found
react-native-macos: Not Found
npmGlobalPackages:
react-native: Not Found

Steps to reproduce

open snack link and add/remove blurRadius from ImageBackground component.

Snack, code example, screenshot, or link to a repository

https://snack.expo.dev/@saurabhkanswalquizizz/imagebackground-blurradius

More Details About Repo
Owner Name facebook
Repo Name react-native
Full Name facebook/react-native
Language JavaScript
Created Date 2015-01-09
Updated Date 2022-12-10
Star Count 106395
Watcher Count 3660
Fork Count 22685
Issue Count 2288

YOU MAY BE INTERESTED

Issue Title Created Date Comment Count Updated Date
Error 803: system has unsupported display driver / cuda driver combination 1 2022-10-28 2022-12-02
[Bug] Get Account Transactions API returns same timestamp for all txn. 2 2022-04-19 2022-10-23
Release 1.3.1 (OBS-Studio 27.2.4 WebRTC m100)在windows上安装提升NDI Runtime未找到 0 2022-09-26 2022-11-08
[ERROR] Runtime.ImportModuleError: Unable to import module 'app': No module named 'sascorer' Traceback (most recent call last): 14 2022-02-18 2022-09-12
Missing template can freeze the Kafka runner 0 2022-05-04 2022-10-17
[`./bin/test`] Allow skipping clone of `swift-docc` and `swift-docc-render-artifact` 6 2022-07-26 2022-12-04
suggest adding missing compat entries in bulk 2 2021-11-16 2022-12-09
Unable to use vlan to connect loop network while using SR-IOV 0 2022-11-19 2022-12-10
Very wonderful tool 2 2021-12-21 2022-01-16
Update to Testcontainers 1.17.1 0 2022-04-12 2022-10-17
Support for Finch 0.9.x? 1 2021-11-30 2022-12-08
Alert Facade doesn't work! 13 2020-01-07 2022-11-25
GPS isn't distinct 2 2019-01-11 2021-12-25
iPhone URL and menu bar at the bottom covers the bottom of modal 0 2022-05-29 2022-11-27
HTTPS / SSL redirection 0 2021-09-21 2022-11-15
kubeless deploy with local zip 2 2021-02-12 2022-11-04
Settings and Actions links in readme broken 2 2022-01-19 2022-12-05
If divine blessing is first in gem list when using blasphemy and a curse it reserves mana. 7 2022-08-16 2022-11-27
Filter block_categories deprecated warnings 0 2022-10-06 2022-11-26
[Icon request] Google Drive 0 2021-06-16 2022-11-26
Access-Control-Request-Method error handling 2 2021-10-04 2022-12-04
Unable to activate account at https://forum.nim-lang.org/ due to error "Invalid ident hash" 5 2020-04-16 2022-12-03
Is there a way to disable skip song when touching the Spotify currently playing 2 2021-01-21 2022-11-30
When using rumble in core 4 2022-02-07 2022-11-08
Don't have space for icons 1 2021-05-09 2022-10-06
韩老师好,这个例子有问题啊,data:10是随机出现的,那是不是说明channel不能阻塞协程 2 2021-06-02 2022-11-15
Content-Security-Policy issue with KC_HOSTNAME_ADMIN option set 6 2022-02-20 2022-11-30
Email field that is not required still renders with an asterisk in registration form 1 2022-10-03 2022-10-04
Canon EOS 20D recognized, but not able to tether 6 2022-05-07 2022-10-04
NVM not installing node versions 0 2022-08-19 2022-08-22
Steve looks like a black cross (Smash Bros. Ultimate) 1 2021-10-26 2022-10-31
cloud logging/monitoring for non-beta submodules 1 2022-06-23 2022-09-03
Delete joins throw `table doesn't support DELETE FROM` 1 2022-07-07 2022-08-21
VCFCluster Hang on particular regions 1 2021-07-03 2022-10-21
401 Error When Invoking ExecuteQuery() Method 1 2022-09-13 2022-11-29
Refactor code for more clarity 0 2020-08-01 2022-12-05
Investigate Cross-origin Isolation (impact on browser agent) 1 2021-05-25 2022-12-08
Android Basics: ViewModel 0 2022-11-06 2022-11-24
How set color over QR code? 1 2018-01-11 2022-12-09
Custom tool configuration (for exporter in custom.js) does not work 1 2022-05-14 2022-12-01
thread 'main' panicked at 'called `Result::unwrap() 4 2021-06-25 2022-09-21
[Question] "Unsubscribed" dependencies in read function 1 2021-09-14 2022-11-30
extension marketplace not opening xhr faild 3 2021-11-19 2022-09-26
@cycle/state ignores write effects until you've actually read from the source 0 2020-04-01 2022-11-17
Add metric counting bounded channel sends that block 0 2022-05-06 2022-10-01
Need help to update the @types/color definitions 4 2022-01-31 2022-12-07
[Monitoring V2] multi-node cluster only registers 1 node for kube-etcd, kube-proxy -> many targets down in prometheus for RKE2 cluster using calico 21 2021-06-04 2022-10-29
Stock-Tools: Annotation "crooked5" has generic langKey "crookedLine" 1 2021-09-10 2022-10-30
MonitoringAlertPolicy creating duplicate resources on failed query 1 2022-04-05 2022-12-08
live option for video output 1 2021-05-13 2022-09-20